{"text_format":"1","workbook":"xlsx","n_sheets":7,"sheets":["Instrucciones de llenado","Formato","Agencias","Productos y Reclamos","Tabla","Hoja2","Hoja1"],"not_rendered":{"charts":0,"images":3,"macros":1,"external_links":1,"defined_names":32,"comments":0,"pivot_tables":0},"unopened":[],"bounds":{"document_bytes":16777216,"sheet_cells":100000,"rows_first":2000,"rows_last":500,"rows_between":2000,"halvings":0,"cell_chars":16384,"cell_head_chars":4096},"cells_cut":0,"cells_raw":0,"read":"whole","date_system":"1900"}

{"sheet":"Instrucciones de llenado","index":0,"n_rows":19,"n_cols":12,"rows_kept":19,"cut":false,"hidden":false,"merged":[[16,1,17,11],[6,1,6,11],[7,1,7,3],[12,1,13,1],[12,2,14,11]]}
[1]
[]
[]
[]
[]
[]
[null,"Para  solicitar la reconsideración de su queja o reclamo al Defensor del Cliente y Usuario Bancario, debes seguir los siguientes pasos:"]
[]
[null,"1.","Completa la información que se solicita en este formulario, agrupada en 3 partes:"]
[null,null,null,"a.   Información del reclamante (Cliente o Usuario)."]
[null,null,null,"b.  Información de la Agencia, Departamento o Servicio del Banco objeto del reclamo."]
[null,null,null,"c.   Información de la materia a reclamar"]
[null,"2.       ","Una vez que llenes el formulario \"Formalización de la Reconsideración\" con la información obligatoria, elige la opción \"Guardar\" y envíalo al Buzón del Defensor (defensordelclienteysuariobancario@bancoexterior.com) con los documentos y/o evidencias que consideres necesarias."]
[]
[]
[]
[null,"Si deseas solicitar la reconsideración del reclamo o queja directamente en una de las Agencias del Banco Exterior, acércate a una de las Oficinas más cercanas y solicita un formulario para tramitar la \"Formalización de la Reconsideración\" ante la Defensoría del Cliente y Usuario Bancario."]
[]
[null,null,null,null,null,null,null,null,null,null,null,"Siguiente…"]

{"sheet":"Formato","index":1,"n_rows":73,"n_cols":38,"rows_kept":73,"cut":false,"hidden":false,"merged":[[61,1,71,28],[72,26,72,28],[13,1,13,3],[15,1,15,3],[7,14,7,27],[13,5,13,15],[11,5,11,27],[20,1,20,28],[24,1,24,3],[17,1,17,3],[15,25,15,27],[15,23,15,24],[15,11,15,13],[22,17,22,18],[22,19,22,20],[22,21,22,27],[2,19,2,21],[7,6,7,10],[13,16,13,18],[13,19,13,27],[9,23,9,27],[9,5,9,20],[2,22,2,25],[2,26,2,28],[5,1,5,28],[9,1,9,3],[3,1,3,3],[2,13,2,16],[2,11,2,12],[3,6,3,8],[7,1,7,3],[11,1,11,3],[17,5,17,27],[24,5,24,15],[15,19,15,21],[15,4,15,5],[15,6,15,10],[15,14,15,18],[43,6,43,13],[22,5,22,15],[26,1,26,3],[28,1,28,3],[28,5,28,27],[41,2,41,5],[43,15,43,17],[43,18,43,25],[37,1,37,5],[35,7,35,18],[37,8,37,25],[26,5,26,15],[22,1,22,3],[60,22,60,28],[2,17,2,18],[33,1,33,28],[35,2,35,4],[44,1,44,3],[39,7,39,10],[47,1,51,28],[46,1,46,28],[39,1,39,5],[41,7,41,15],[59,1,59,28],[41,20,41,25],[41,17,41,19],[53,1,53,28],[54,1,58,28],[43,2,43,4]]}
[0,null,null,null,null,null,null,null,null,null,null,null,null,null,null,null,null,null,null,null,null,null,null,null,null,null,null,null,null,null,null,null,null,null,null,null,null,{"$f":"MID(CELL(\"nombrearchivo\",A1),FIND(\"[\",CELL(\"nombrearchivo\",A1))+1,FIND(\"]\",CELL(\"nombrearchivo\",A1))-FIND(\"[\",CELL(\"nombrearchivo\",A1))-1)","v":"Formato Reclamos Defensor del Cliente y Usuario Bancarío (5).xlsm"}]
[null,null,null,null,null,null,null,null,null,"FORMALIZACIÓN DE LA RECONSIDERACIÓN"]
[null,null,null,null,null,null,null,null,null,null,null,"*Lugar",null,null,null,null,null,"*Fecha",null,null,null,null,"*N° de Reclamo"]
[null,"Cliente",null,null,null,null,"Usuario"]
[]
[null,"INFORMACIÓN DEL RECLAMANTE "]
[]
[null,"*C.I / RIF/\n Pasaporte",null,null,null,null,null,null,null,null,null,null,null,{"$f":"IF(OR(F8=\"J\",F8=\"G\",F8=\"R\"),\"*Razón Social\",\"\")","v":""}]
[]
[null,{"$f":"IF($N$8=\"Razón Social\",\"*Nombre del Apoderado\",\"*Nombre y Apellido\")","v":"*Nombre y Apellido"},null,null,null,null,null,null,null,null,null,null,null,null,null,null,null,null,null,null,null,{"$f":"IF($N$8=\"Razon Social\",\"C.I.:\",\"\")","v":""}]
[]
[null,"*Dirección"]
[]
[null,"*Ciudad",null,null,null,null,null,null,null,null,null,null,null,null,null,null,"*Estado"]
[]
[null,"*Teléfonos",null,null,"Casa",null,null,null,null,null,null,"Trabajo",null,null,null,null,null,null,null,"Celular"]
[]
[null,"Correo\n Electrónico"]
[]
[]
[null,"INFORMACIÓN DE LA AGENCIA, DEPARTAMENTO O SERVICIO DEL BANCO OBJETO DEL RECLAMO"]
[]
[null,"*Agencia",null,null,null,null,null,null,null,null,null,null,null,null,null,null,"N°",{"$f":"IF(F23=\"\",\"\",VLOOKUP(F23,Agencias!A2:D114,2,0))","v":""},null,"*Otros",null,"Colocar Departamento/Servicio"]
[]
[null,"Región",null,null,null,{"$f":"IF(F23=\"\",\"\",VLOOKUP(F23,Agencias!A2:D114,3,0))","v":""}]
[]
[null,"Estado",null,null,null,{"$f":"IF(F23=\"\",\"\",VLOOKUP(F23,Agencias!A2:D114,4,0))","v":""}]
[]
[null,"Ejecutivo"]
[]
[]
[]
[]
[null,"INFORMACIÓN DE LA MATERIA A RECLAMAR"]
[]
[null,null,"*Productos",null,null,null,{"$f":"IF(H36=\"\",\"\",VLOOKUP(H36,'Productos y Reclamos'!B1:H95,2,0))","v":""}]
[]
[null,"*Tipo de Reclamo",null,null,null,null,null,{"$f":"IF(I38=\"\",\"\",VLOOKUP(I38,'Productos y Reclamos'!D1:H95,5,0))","v":""}]
[]
[null,"*Monto reclamado"]
{"$rows_left_out":34}
{"sheet":"Agencias","index":2,"n_rows":114,"n_cols":6,"rows_kept":114,"cut":false,"hidden":true,"merged":[]}
["Agencia","Cod. Agencia","Región","Estado","TipoG"]
["ACARIGUA","0037","CENTRO-OCCIDENTE","PORTUGUESA","E","EXTRANJERO"]
["ACARIGUA LLANO MALL","0014","CENTRO-OCCIDENTE","PORTUGUESA","G","GOBIERNO"]
["ALTO BARINAS","0095","CENTRO-OCCIDENTE","BARINAS","J","JURÍDICO"]
["ANACO","0073","ORIENTE","ANZOÁTEGUI","P","PASAPORTE"]
["AV. MANUEL PIAR","0105","ORIENTE","BOLIVAR","V","VENEZOLANO"]
["BANCA CORPORATIVA ARAGUA","-","CENTRO","N/A"]
["BANCA CORPORATIVA CARABOBO","-","CENTRO","N/A"]
["BANCA CORPORATIVA CENTRO OCCIDENTE","-","CENTRO OCCIDENTE","N/A"]
["BANCA CORPORATIVA METROPOLITANA","-","METROPOLITÁNA","N/A"]
["BANCA CORPORATIVA METROPOLITANA II","-","METROPOLITÁNA","N/A"]
["BANCA CORPORATIVA METROPOLITANA III","-","METROPOLITÁNA","N/A"]
["BANCA CORPORATIVA OCCIDENTE","-","OCCIDENTE","N/A"]
["BANCA CORPORATIVA ORIENTE","-","ORIENTE","N/A"]
["BANCA PRIVADA - INSTITUCIONAL","-","N/A","N/A"]
["BARALT NORTE","0102","METROPOLITANA NOR-OESTE","DISTRITO CAPITAL"]
["BARCELONA","0081","ORIENTE","ANZOÁTEGUI"]
["BARINAS","0079","CENTRO-OCCIDENTE","BARINAS"]
["BARQUISIMETO","0035","CENTRO-OCCIDENTE","LARA"]
["BARQUISIMETO ESTE","0039","CENTRO-OCCIDENTE","LARA"]
["BARQUISIMETO OESTE","0026","CENTRO-OCCIDENTE","LARA"]
["BELLO MONTE","0025","METROPOLITANA SUR-ESTE","MIRANDA"]
["BOLEITA","0060","METROPOLITANA SUR-ESTE","MIRANDA"]
["CAGUA","0057","CENTRO","ARAGUA"]
["CALABOZO","0042","CENTRO","GUÁRICO"]
["CAMPO ALEGRE","0024","METROPOLITANA SUR-ESTE","MIRANDA"]
["CARÚPANO","0111","ORIENTE","SUCRE"]
["CATIA","0041","METROPOLITANA NOR-OESTE","DISTRITO CAPITAL"]
["CATIA LA MAR","0061","METROPOLITANA NOR-OESTE","VARGAS"]
["CENTRO CARACAS","0040","METROPOLITANA NOR-OESTE","DISTRITO CAPITAL"]
["CENTRO VALENCIA","0051","CENTRO","CARABOBO"]
["CHACAO","0020","METROPOLITANA SUR-ESTE","MIRANDA"]
["CHARALLAVE","0034","METROPOLITANA NOR-OESTE","MIRANDA"]
["CHUAO","0022","METROPOLITANA SUR-ESTE","MIRANDA"]
["CIUDAD BOLIVAR","0092","ORIENTE","BOLIVAR"]
["CIUDAD OJEDA","0086","OCCIDENTE-ANDES","ZULIA"]
["COCHE","0046","METROPOLITANA NOR-OESTE","DISTRITO CAPITAL"]
["CORO","0100","OCCIDENTE-ANDES","FALCÓN"]
["CUMANA","0078","ORIENTE","SUCRE"]
["EL PARAISO","0029","METROPOLITANA NOR-OESTE","DISTRITO CAPITAL"]
{"$rows_left_out":75}
{"sheet":"Productos y Reclamos","index":3,"n_rows":95,"n_cols":13,"rows_kept":95,"cut":false,"hidden":true,"merged":[[25,2,32,2],[25,1,32,1],[0,3,0,6],[1,2,14,2],[1,1,14,1],[15,2,24,2],[15,1,24,1],[33,2,36,2],[33,1,36,1],[37,2,43,2],[37,1,43,1],[44,2,47,2],[44,1,47,1],[48,2,52,2],[48,1,52,1],[53,2,57,2],[53,1,57,1],[65,2,73,2],[65,1,73,1],[85,2,89,2],[85,1,89,1],[90,2,94,2],[90,1,94,1],[74,2,80,2],[74,1,80,1],[81,2,82,2],[81,1,82,1],[83,2,84,2],[83,1,84,1]]}
[null,"Productos","Código","Tipo de reclamo",null,null,null,"Código",null,null,null,null,"Prepagada"]
[null,"TDC",30,"Monto cargado y no dispensado en ATM’S",null,null,null,2]
[null,null,null,"Presunto Anatocismo",null,null,null,4,null,"TDC"]
[null,null,null,"Consumos o Montos No Reconocidos",null,null,null,5,null,"TDD"]
[null,null,null,"Tarjetas Retenidas en ATM´S (Exterior)",null,null,null,6,null,"Prepagada"]
[null,null,null,"Presunto Robo o Hurto",null,null,null,8,null,"Libreta de Ahorro"]
[null,null,null,"Negativa de Otorgamiento/Apertura/Adjudicación",null,null,null,9,null,"Atención al Cliente y Servicios de Oficina"]
[null,null,null,"Presunta Inclusión y/o Calificación Indebida en el SICRI",null,null,null,10,null,"Cheques"]
[null,null,null,"Tasas, Tarifas y Comisiones",null,null,null,11,null,"Caja de Seguridad"]
[null,null,null,"Presunto Bloqueo o Cancelación",null,null,null,12,null,"Cheques de Gerencia"]
[null,null,null,"Retraso en Envío de Correspondencia",null,null,null,18,null,"Crédito Hipotecario"]
[null,null,null,"Falta de Insumos",null,null,null,21,null,"Crédito de Vehículo"]
[null,null,null,"Presunto Sobregiro Cupo CADIVI",null,null,null,22,null,"Crédito Agrícola"]
[null,null,null,"Operaciones No Acreditadas",null,null,null,23,null,"Crédito Personal"]
[null,null,null,"Tarjetas Retenidas en ATM´S (Nacional)",null,null,null,25,null,"Microcrédito"]
[null,"TDD",31,"Monto cargado y no dispensado en ATM’S",null,null,null,2,null,"Crédito Comercial"]
[null,null,null,"Débitos No Reconocidos",null,null,null,3,null,"Crédito al Turismo"]
[null,null,null,"Consumos o Montos No Reconocidos",null,null,null,5,null,"Cuenta Corriente"]
[null,null,null,"Presunto Robo o Hurto",null,null,null,8,null,"Cuenta de Ahorro"]
[null,null,null,"Negativa de Otorgamiento/Apertura/Adjudicación",null,null,null,9,null,"Bonos de la Deuda Pública"]
[null,null,null,"Tasas, Tarifas y Comisiones",null,null,null,11,null,"Operaciones Cambiarias"]
[null,null,null,"Presunto Bloqueo o Cancelación",null,null,null,12,null,"Depósitos a Plazo Fijo"]
[null,null,null,"Transferencia No Reconocida",null,null,null,13,null,"Fideicomiso"]
[null,null,null,"Falta de Insumos",null,null,null,21]
[null,null,null,"Tarjetas Retenidas en ATM´S (Nacional)",null,null,null,25]
[null,"Prepagada",32,"Monto cargado y no dispensado en ATM’S",null,null,null,2]
[null,null,null,"Consumos o Montos No Reconocidos",null,null,null,5]
[null,null,null,"Presunta Negativa de Entrega de Haberes",null,null,null,7]
[null,null,null,"Presunto Robo o Hurto",null,null,null,8]
[null,null,null,"Negativa de Otorgamiento/Apertura/Adjudicación",null,null,null,9]
[null,null,null,"Tasas, Tarifas y Comisiones",null,null,null,11]
[null,null,null,"Presunto Bloqueo o Cancelación",null,null,null,12]
[null,null,null,"Falta de Insumos",null,null,null,21]
[null,"Libreta de Ahorro",33,"Débitos No Reconocidos",null,null,null,3]
[null,null,null,"Transferencia No Reconocida",null,null,null,13]
[null,null,null,"Falta de Insumos",null,null,null,21]
[null,null,null,"Operaciones No Acreditadas",null,null,null,23]
[null,"Atención al Cliente y Servicios de Oficina",50,"Presunto Robo o Hurto",null,null,null,8]
[null,null,null,"Atención Indebida al Público",null,null,null,15]
[null,null,null,"Indebida Atención Preferencial",null,null,null,16]
{"$rows_left_out":56}
{"sheet":"Tabla","index":4,"n_rows":115,"n_cols":22,"rows_kept":115,"cut":false,"hidden":true,"merged":[[1,5,1,6]]}
[null,"Tipo de Instrumento y Tipo de Reclamo AT13"]
[null,"Tipo de Instrumento",null,"Tipo de Reclamo",null,"Estatus del Reclamo"]
["Decripción","Código","Decripción","Código",null,"Código","Decripción",null,null,null,null,null,null,null,null,"Reclamo","Monto Reclamado  (H42)","Número de TDC (H44)","Tipo de Tarjeta (V44)","Número de TDD (P42)","Número de Cuenta \n(por crear)","Número de Cheque\n(por crear)"]
["TDC",1,"Monto cargado y no dispensado en ATM’S",2,null,1,"En Trámite",null,null,"Cheques",null,null,null,"Cliente","TDC","Monto cargado y no dispensado en ATM’S","SI","SI","SI","-","-","-"]
[null,null,"Presunto Anatocismo",4,null,2,"Procedente",null,null,"Cheques de Gerencia",null,null,null,"Cliente",null,"Presunto Anatocismo","SI","SI","SI","-","-","-"]
[null,null,"Consumos o Montos No Reconocidos",5,null,3,"No Procedente",null,null,"Cuenta Corriente",null,null,null,"Cliente",null,"Consumos o Montos No Reconocidos","SI","SI","SI","-","-","-"]
[null,null,"Tarjetas Retenidas en ATM´S (Exterior)",6,null,5,"Parcialmente Procedente",null,null,"Cuenta de Ahorro",null,null,null,"Cliente",null,"Tarjetas Retenidas en ATM´S (Exterior)","-","SI","SI","-","-","-"]
[null,null,"Negativa de Otorgamiento/Apertura/Adjudicación",9,null,null,null,null,null,"Libreta de Ahorro",null,null,null,"Cliente",null,"Negativa de Otorgamiento/Apertura/Adjudicación","-","-","-","-","-","-"]
[null,null,"Presunta Inclusión y/o Calificación Indebida en el SICRI",10,null,null,null,null,null,"Internet Banking",null,null,null,"Cliente",null,"Presunta Inclusión y/o Calificación Indebida en el SICRI","-","-","-","-","-","-"]
[null,null,"Tasas, Tarifas y Comisiones",11,null,null,null,null,null,null,null,null,null,"Cliente",null,"Tasas, Tarifas y Comisiones","SI","SI","SI","-","-","-"]
[null,null,"Presunto Bloqueo o Cancelación",12,null,null,"TDC",null,null,null,null,null,null,"Cliente",null,"Presunto Bloqueo o Cancelación","-","SI","SI","-","-","-"]
[null,null,"Retraso en Envío de Correspondencia",18,null,null,"TDD",null,null,null,null,null,null,"Cliente",null,"Retraso en Envío de Correspondencia","-","-","-","-","-","-"]
["TDD",2,"Monto cargado y no dispensado en ATM’S",2,null,null,"Prepagada",null,null,null,null,null,null,"Cliente","TDD","Monto cargado y no dispensado en ATM’S","SI","-","-","SI","-","-"]
[null,null,"Débitos No Reconocidos",3,null,null,"Libreta_de_Ahorro",null,null,null,null,null,null,"Cliente",null,"Débitos No Reconocidos","SI","-","-","SI","-","-"]
[null,null,"Negativa de Otorgamiento/Apertura/Adjudicación",9,null,null,"Internet_Banking",null,null,null,null,null,null,"Cliente",null,"Negativa de Otorgamiento/Apertura/Adjudicación","-","-","-","-","-","-"]
[null,null,"Tasas, Tarifas y Comisiones",11,null,null,"Atención_al_Cliente_y_Servicios_de_Oficina",null,null,null,null,null,null,"Cliente",null,"Tasas, Tarifas y Comisiones","SI","-","-","SI","-","-"]
[null,null,"Presunto Bloqueo o Cancelación",12,null,null,"Cheques",null,null,null,null,null,null,"Cliente",null,"Presunto Bloqueo o Cancelación","-","-","-","SI","-","-"]
[null,null,"Transferencia No Reconocida",13,null,null,"Cheques_de_Gerencia",null,null,null,null,null,null,"Cliente",null,"Transferencia No Reconocida","SI","-","-","SI","-","-"]
["Prepagada",3,"Monto cargado y no dispensado en ATM’S",2,null,null,"Crédito_Hipotecario",null,null,null,null,null,null,"Cliente","Prepagada","Monto cargado y no dispensado en ATM’S","SI","SI","SI","-","-","-"]
[null,null,"Consumos o Montos No Reconocidos",5,null,null,"Crédito_de_Vehículo",null,null,null,null,null,null,"Cliente",null,"Consumos o Montos No Reconocidos","SI","SI","SI","-","-","-"]
[null,null,"Presunta Negativa de Entrega de Haberes",7,null,null,"Crédito_Agrícola",null,null,null,null,null,null,"Cliente",null,"Presunta Negativa de Entrega de Haberes","SI","SI","SI","-","-","-"]
[null,null,"Negativa de Otorgamiento/Apertura/Adjudicación",9,null,null,"Crédito_Personal",null,null,null,null,null,null,"Cliente",null,"Negativa de Otorgamiento/Apertura/Adjudicación","-","-","-","-","-","-"]
[null,null,"Tasas, Tarifas y Comisiones",11,null,null,"Microcrédito",null,null,null,null,null,null,"Cliente",null,"Tasas, Tarifas y Comisiones","SI","SI","SI","-","-","-"]
[null,null,"Presunto Bloqueo o Cancelación",12,null,null,"Crédito_Comercial",null,null,null,null,null,null,"Cliente",null,"Presunto Bloqueo o Cancelación","-","SI","SI","-","-","-"]
["Libreta_de_Ahorro",4,"Débitos No Reconocidos",3,null,null,"Crédito_al_Turismo",null,null,null,null,null,null,"Cliente","Libreta de Ahorro","Débitos No Reconocidos","SI","-","-","-","-","-"]
[null,null,"Operaciones No Acreditadas",23,null,null,"Cuenta_Corriente",null,null,null,null,null,null,"Cliente",null,"Operaciones No Acreditadas","SI","-","-","-","-","-"]
["Internet_Banking",5,"Débitos No Reconocidos",3,null,null,"Cuenta_de_Ahorro",null,null,null,null,null,null,"Cliente","Internet Banking","Débitos No Reconocidos","SI","-","-","-","SI","-"]
[null,null,"Consumos o Montos No Reconocidos",5,null,null,"Bonos_de_la_Deuda_Pública",null,null,null,null,null,null,"Cliente",null,"Consumos o Montos No Reconocidos","SI","-","-","-","SI","-"]
[null,null,"Tasas, Tarifas y Comisiones",11,null,null,"Operaciones_Cambiarias",null,null,null,null,null,null,"Cliente",null,"Tasas, Tarifas y Comisiones","SI","-","-","-","SI","-"]
[null,null,"Transferencia No Reconocida",13,null,null,"Depósitos_a_Plazo_Fijo",null,null,null,null,null,null,"Cliente",null,"Transferencia No Reconocida","SI","-","-","-","SI","-"]
[null,null,"Funcionamiento Inadecuado de Sistemas",19,null,null,"Fideicomiso",null,null,null,null,null,null,"Cliente",null,"Funcionamiento Inadecuado de Sistemas","-","-","-","-","-","-"]
[null,null,"Operaciones No Acreditadas",23,null,null,"IVR_o_Interactive_Voice_Response",null,null,null,null,null,null,"Cliente",null,"Operaciones No Acreditadas","SI","-","-","-","SI","-"]
["Atención_al_Cliente_y_Servicios_de_Oficina",6,"Presunto Robo o Hurto",8,null,null,"Atención_al_Cliente_y_Servicios_de_Oficina",null,null,null,null,null,null,"Cliente","Atención_al_Cliente_y_Servicios_de_Oficina","Presunto Robo o Hurto","-","-","-","-","-","-"]
[null,null,"Atención Indebida al Público",15,null,null,"IVR_o_Interactive_Voice_Response",null,null,null,null,null,null,"Cliente",null,"Atención Indebida al Público","-","-","-","-","-","-"]
[null,null,"Indebida Atención Preferencial",16,null,null,"Depósitos_a_Plazo_Fijo","404849","Visa Centralizada",null,null,null,null,"Cliente",null,"Indebida Atención Preferencial","-","-","-","-","-","-"]
[null,null,"Retraso en Envío de Correspondencia",18,null,null,"Fideicomiso","407602","Visa Distribucion",null,null,null,null,"Cliente",null,"Retraso en Envío de Correspondencia","-","-","-","-","-","-"]
[null,null,"Funcionamiento Inadecuado de Sistemas",19,null,null,"Cuenta_Corriente","411018","Visa Platinum",null,null,null,null,"Cliente",null,"Funcionamiento Inadecuado de Sistemas","-","-","-","-","-","-"]
[null,null,"Funcionamiento Inadecuado de Oficinas",20,null,null,"Cuenta_de_Ahorro","421882","Visa Active",null,null,null,null,"Cliente",null,"Funcionamiento Inadecuado de Oficinas","-","-","-","-","-","-"]
[null,null,"Falta de Insumos",21,null,null,null,"454732","Visa Empresarial",null,null,null,null,"Cliente",null,"Falta de Insumos","-","-","-","-","-","-"]
["Cheques",7,"Presunto Pago Indebido",1,null,null,null,"456033","Via Oro",null,null,null,null,"Cliente","Cheques","Presunto Pago Indebido","SI","-","-","-","SI","SI"]
{"$rows_left_out":76}
{"sheet":"Hoja2","index":5,"n_rows":4,"n_cols":49,"rows_kept":4,"cut":false,"hidden":true,"merged":[]}
[]
[]
["Fecha de Recepción","Dictamen Defensor","NUMERO RECLAMO (defensor)","OFICINA","OFICINA (descripción)","TIPO CLIENTE","IDENTIFICACION CLIENTE","IBS","NOMBRE O RAZON SOCIAL","FECHA RECONSIDERACION (acuse de recibo)","Vencimiento","Tipo de Instrumento","Tipo de Reclamo","MONTO RECLAMO","Defensor del Cliente y Uaurio Bancario","Comentado con:","Solicitado","Recibido","Solicitado","Recibido","Solicitado","Recibido","Solicitado","Recibido","Solicitado","Recibido","COD. CUENTA CLIENTE","NRO. CREDITO AFECTADO","NRO. TARJETA","STATUS RECLAMO","FECHA SOLUCION","MONTO RECONOCIDO (*)","MONTO REINTEGRO (*)","FECHA REINTEGRO","FECHA NOTIFICACION","Comentarios Solución","Firma de Finiquito","CRITERIOS INFORME","CRITERIOS DCUB","Estadísiticas UAU","AT13","FECHA RECLAMO PRIMARIO","COD. ENTE SUPERVISADO POS O ATM","IDENTIFICACION POS O ATM","OFICINA OBJETO RECLAMO","Mes de Recibo","Mes de Solución","ENTE SUPERVISADO DESTINO ELIMINAR","NOMBRE SISTEMA INF. ELIMINAR"]
[{"$f":"Formato!T3","v":"00:00:00"},null,null,{"$f":"Formato!R23","v":""},{"$f":"Formato!F23","v":0},null,{"$f":"CONCATENATE(Formato!F8,\"-\",Formato!G8)","v":"-"},null,{"$f":"IF(OR(Formato!F8=\"J\",Formato!F8=\"G\",Formato!F8=\"R\"),Formato!O8,Formato!XFD10&\" \"&Formato!#REF!)","v":{"$error":"#REF!"}},null,null,{"$f":"Formato!H36","v":0},{"$f":"Formato!I38","v":0},{"$f":"Formato!H40","v":0},null,null,null,null,null,null,null,null,null,null,null,null,{"$f":"Formato!G44","v":0},null,{"$f":"Formato!H42","v":0}]

{"sheet":"Hoja1","index":6,"n_rows":0,"n_cols":0,"rows_kept":0,"cut":false,"hidden":true,"merged":[]}